Uploaded image for project: 'Nuxeo Platform'
  1. Nuxeo Platform
  2. NXP-30051

Fix JSF UI master build

    Details

    • Type: Bug
    • Status: Resolved
    • Priority: Major
    • Resolution: Fixed
    • Affects Version/s: None
    • Fix Version/s: 11.5
    • Component/s: CI/CD

      Description

      Failing systematically with:

      09:46:02  [INFO] ------------< org.nuxeo.ecm.platform:nuxeo-platform-ui-web >------------
      09:46:02  [INFO] Building Nuxeo Web Framework 11.5-SNAPSHOT                       [20/86]
      09:46:02  [INFO] --------------------------------[ jar ]---------------------------------
      09:46:15  [INFO] 
      09:46:15  [INFO] --- maven-enforcer-plugin:1.4.1:enforce (enforce-dependencies) @ nuxeo-admin-center-monitoring ---
      09:46:15  [INFO] Skipping Rule Enforcement.
      
      ...
      
      09:46:16  [INFO] --- maven-antrun-plugin:3.0.0:run (bower-install) @ nuxeo-platform-webapp ---
      09:46:16  [INFO] Executing tasks
      09:46:20  [INFO]      [exec] npm WARN nuxeo-platform-webapp@0.0.0 No description
      09:46:20  [INFO]      [exec] added 178 packages from 96 contributors and audited 178 packages in 2.633s
      09:46:20  [INFO]      [exec] npm WARN nuxeo-platform-webapp@0.0.0 No repository field.
      09:46:20  [INFO]      [exec] npm WARN nuxeo-platform-webapp@0.0.0 No license field.
      09:46:20  [INFO]      [exec] 
      09:46:20  [INFO]      [exec] found 36 vulnerabilities (14 low, 7 moderate, 15 high)
      09:46:20  [INFO]      [exec]   run `npm audit fix` to fix them, or `npm audit` for details
      09:46:20  [INFO]      [exec] bower gold-email-input#1.0.8       not-cached git://github.com/PolymerElements/gold-email-input.git#1.0.8
      
      ...
      
      09:46:26  [INFO]      [exec] nuxeo-document-permissions#0.2.8 target/classes/web/nuxeo.war/bower_components/nuxeo-document-permissions
      09:46:26  [INFO]      [exec] ├── better-dateinput-polyfill#1.5.2
      09:46:26  [INFO]      [exec] ├── gold-email-input#1.0.8
      09:46:26  [INFO]      [exec] ├── iron-elements#1.0.10
      09:46:26  [INFO]      [exec] ├── moment#2.10.6
      09:46:26  [INFO]      [exec] ├── nuxeo-elements#0.2.7
      09:46:26  [INFO]      [exec] ├── paper-elements#1.0.7
      09:46:26  [INFO]      [exec] └── polymer#1.7.0
      09:46:26  [INFO]      [exec] 
      09:46:26  [INFO]      [exec] marked-element#1.1.3 target/classes/web/nuxeo.war/bower_components/marked-element
      09:46:26  [INFO]      [exec] ├── marked#0.3.6
      09:46:26  [INFO]      [exec] └── polymer#1.7.0
      09:46:26  [INFO]      [exec] 
      09:46:26  [INFO]      [exec] moment#2.10.6 target/classes/web/nuxeo.war/bower_components/moment
      09:46:27  [INFO]      [exec] Running "vulcanize:permissions" (vulcanize) task
      09:46:28  [INFO]      [exec] Fatal error: ENOENT: no such file or directory, open 'target/classes/web/nuxeo.war/permissions/components/elements.vulcanized.html'
      
      ...
      
      09:46:28  [INFO] Nuxeo - JSF UI Code ................................ SUCCESS [  0.971 s]
      09:46:28  [INFO] Nuxeo Administration Center Analytics .............. SUCCESS [01:52 min]
      09:46:28  [INFO] Nuxeo Web Test Framework ........................... SUCCESS [02:18 min]
      09:46:28  [INFO] Nuxeo Web Framework ................................ SKIPPED
      
      ...
      
      09:46:28  [INFO] BUILD FAILURE
      09:46:28  [INFO] ------------------------------------------------------------------------
      09:46:28  [INFO] Total time:  02:48 min (Wall Clock)
      09:46:28  [INFO] Finished at: 2021-01-12T08:46:28Z
      09:46:28  [INFO] ------------------------------------------------------------------------
      09:46:28  [ERROR] Failed to execute goal org.apache.maven.plugins:maven-antrun-plugin:3.0.0:run (bower-install) on project nuxeo-platform-webapp: An Ant BuildException has occured: The following error occurred while executing this line:
      09:46:28  [ERROR] /home/jenkins/workspace/nuxeo_nuxeo-jsf-ui_master/code/nuxeo-platform-webapp/build.xml:31: exec returned: 1
      09:46:28  [ERROR] around Ant part ...<ant antfile="/home/jenkins/workspace/nuxeo_nuxeo-jsf-ui_master/code/nuxeo-platform-webapp/build.xml" dir="/home/jenkins/workspace/nuxeo_nuxeo-jsf-ui_master/code/nuxeo-platform-webapp" target="build"></ant>... @ 4:205 in /home/jenkins/workspace/nuxeo_nuxeo-jsf-ui_master/code/nuxeo-platform-webapp/target/antrun/build-main.xml
      

       
      See latest failure: https://jenkins.platform.dev.nuxeo.com/job/nuxeo/job/nuxeo-jsf-ui/job/master/155/console.

        Attachments

          Issue Links

            Activity

              People

              • Votes:
                0 Vote for this issue
                Watchers:
                2 Start watching this issue

                Dates

                • Created:
                  Updated:
                  Resolved:

                  Time Tracking

                  Estimated:
                  Original Estimate - Not Specified
                  Not Specified
                  Remaining:
                  Remaining Estimate - 0 minutes
                  0m
                  Logged:
                  Time Spent - 30 minutes
                  30m

                    PagerDuty

                    Error rendering 'com.pagerduty.jira-server-plugin:PagerDuty'. Please contact your Jira administrators.