Uploaded image for project: 'Nuxeo Platform'
  1. Nuxeo Platform
  2. NXP-13257

Fix sample marketplace Funkload tests

    XMLWordPrintable

    Details

    • Type: Bug
    • Status: Resolved
    • Priority: Major
    • Resolution: Cannot Reproduce
    • Affects Version/s: 5.8
    • Fix Version/s: 8.10

      Description

      https://qa.nuxeo.org/jenkins/job/addons_FT_nuxeo-sample-project-master/830/console:

      20:01:32 funkload-ctl-daemons:
      20:01:34      [exec] Traceback (most recent call last):
      20:01:34      [exec]   File "/usr/local/bin/fl-monitor-ctl", line 9, in <module>
      20:01:34      [exec]     load_entry_point('funkload==1.17.0b-20130327', 'console_scripts', 'fl-monitor-ctl')()
      20:01:34      [exec]   File "/usr/local/lib/python2.7/dist-packages/funkload-1.17.0b_20130327-py2.7.egg/funkload/Monitor.py", line 208, in main
      20:01:34      [exec]     ctl = MonitorController()
      20:01:34      [exec]   File "/usr/local/lib/python2.7/dist-packages/funkload-1.17.0b_20130327-py2.7.egg/funkload/XmlRpcBase.py", line 223, in __init__
      20:01:34      [exec]     self.host = conf.get('server', 'host')
      20:01:34      [exec]   File "/usr/lib/python2.7/ConfigParser.py", line 607, in get
      20:01:34      [exec]     raise NoSectionError(section)
      20:01:34      [exec] ConfigParser.NoSectionError: No section: 'server'
      20:01:34      [exec] Result: 1
      20:01:34      [exec] Traceback (most recent call last):
      20:01:34      [exec]   File "/usr/local/bin/fl-credential-ctl", line 9, in <module>
      20:01:34      [exec]     load_entry_point('funkload==1.17.0b-20130327', 'console_scripts', 'fl-credential-ctl')()
      20:01:34      [exec]   File "/usr/local/lib/python2.7/dist-packages/funkload-1.17.0b_20130327-py2.7.egg/funkload/CredentialFile.py", line 202, in main
      20:01:34      [exec]     ctl = CredentialFileController()
      20:01:34      [exec]   File "/usr/local/lib/python2.7/dist-packages/funkload-1.17.0b_20130327-py2.7.egg/funkload/XmlRpcBase.py", line 223, in __init__
      20:01:34      [exec]     self.host = conf.get('server', 'host')
      20:01:34      [exec]   File "/usr/lib/python2.7/ConfigParser.py", line 607, in get
      20:01:34      [exec]     raise NoSectionError(section)
      20:01:34      [exec] ConfigParser.NoSectionError: No section: 'server'
      20:01:35 
      20:01:35 BUILD FAILED
      20:01:35 /home/hudson/tmp/workspace/addons_FT_nuxeo-sample-project-master/ftest/funkload/target/nuxeo-ftest.xml:635: The following error occurred while executing this line:
      20:01:35 /home/hudson/tmp/workspace/addons_FT_nuxeo-sample-project-master/ftest/funkload/target/nuxeo-ftest.xml:571: exec returned: 1
      20:01:35 
      20:01:35 Total time: 2 seconds
      20:01:35 [ERROR] Error occurred while running /home/hudson/tmp/workspace/addons_FT_nuxeo-sample-project-master/ftest/funkload/itests.xml: The following error occurred while executing this line:
      20:01:35 /home/hudson/tmp/workspace/addons_FT_nuxeo-sample-project-master/ftest/funkload/target/nuxeo-ftest.xml:571: exec returned: 1

        Attachments

          Issue Links

            Activity

              People

              • Votes:
                0 Vote for this issue
                Watchers:
                3 Start watching this issue

                Dates

                • Created:
                  Updated:
                  Resolved:

                  PagerDuty

                  Error rendering 'com.pagerduty.jira-server-plugin:PagerDuty'. Please contact your Jira administrators.