Uploaded image for project: 'Nuxeo Elements'
  1. Nuxeo Elements
  2. ELEMENTS-982

Fix dataviz tests on edge

    XMLWordPrintable

    Details

    • Type: Bug
    • Status: Resolved
    • Priority: Minor
    • Resolution: Fixed
    • Affects Version/s: 3.0.0-SNAPSHOT
    • Fix Version/s: 3.0.0
    • Component/s: Dataviz, Testing
    • Tags:
    • Sprint:
      nxGang Sprint 11.1.13
    • Story Points:
      3

      Description

      Sauce lab tests are failing with:

      11:33:59 Edge 18.17763.0 (Windows 10.0.0) <nuxeo-audit-data> grouped-by FAILED
      11:33:59 	Error: Object doesn't support property or method 'execute' (/tmp/_karma_webpack_/commons.js:36926)Edge 18.17763.0 (Windows 10.0.0) <nuxeo-audit-data> grouped-by FAILED
      11:33:59 	Error: Object doesn't support property or method 'execute' (/tmp/_karma_webpack_/commons.js:36926)Edge 18.17763.0 (Windows 10.0.0) <nuxeo-audit-data> grouped-by FAILED
      11:33:59 	Error: Object doesn't support property or method 'execute' (/tmp/_karma_webpack_/commons.js:36926)	TypeError: Object doesn't support property or method 'execute'
      11:33:59 	   at Nuxeo.AggregateDataBehavior.fetch (/tmp/_karma_webpack_/commons.js:1223:5635)
      11:33:59 	   at Anonymous function (/tmp/_karma_webpack_/commons.js:1494:5)
      11:33:59 	   at Generator.prototype.next (native code)Edge 18.17763.0 (Windows 10.0.0) <nuxeo-audit-data> grouped-by FAILED
      11:33:59 	Error: Object doesn't support property or method 'execute' (/tmp/_karma_webpack_/commons.js:36926)	TypeError: Object doesn't support property or method 'execute'
      11:33:59 	   at Nuxeo.AggregateDataBehavior.fetch (/tmp/_karma_webpack_/commons.js:1223:5635)
      11:33:59 	   at Anonymous function (/tmp/_karma_webpack_/commons.js:1494:5)
      11:33:59 	   at Generator.prototype.next (native code)Edge 18.17763.0 (Windows 10.0.0) <nuxeo-audit-data> metrics FAILED
      11:33:59 	Error: Object doesn't support property or method 'execute' (/tmp/_karma_webpack_/commons.js:36926)Edge 18.17763.0 (Windows 10.0.0) <nuxeo-audit-data> metrics FAILED
      11:33:59 	Error: Object doesn't support property or method 'execute' (/tmp/_karma_webpack_/commons.js:36926)Edge 18.17763.0 (Windows 10.0.0) <nuxeo-audit-data> metrics FAILED
      11:33:59 	Error: Object doesn't support property or method 'execute' (/tmp/_karma_webpack_/commons.js:36926)	TypeError: Object doesn't support property or method 'execute'
      11:33:59 	   at Nuxeo.AggregateDataBehavior.fetch (/tmp/_karma_webpack_/commons.js:1223:5635)
      11:33:59 	   at Anonymous function (/tmp/_karma_webpack_/commons.js:1529:5)
      11:33:59 	   at Generator.prototype.next (native code)Edge 18.17763.0 (Windows 10.0.0) <nuxeo-audit-data> metrics FAILED
      11:33:59 	Error: Object doesn't support property or method 'execute' (/tmp/_karma_webpack_/commons.js:36926)	TypeError: Object doesn't support property or method 'execute'
      11:33:59 	   at Nuxeo.AggregateDataBehavior.fetch (/tmp/_karma_webpack_/commons.js:1223:5635)
      11:33:59 	   at Anonymous function (/tmp/_karma_webpack_/commons.js:1529:5)
      11:33:59 	   at Generator.prototype.next (native code)Edge 18.17763.0 (Windows 10.0.0) <nuxeo-audit-data> metrics FAILED
      11:33:59 	Error: Object doesn't support property or method 'execute' (/tmp/_karma_webpack_/commons.js:36926)	TypeError: Object doesn't support property or method 'execute'
      11:33:59 	   at Nuxeo.AggregateDataBehavior.fetch (/tmp/_karma_webpack_/commons.js:1223:5635)
      11:33:59 	   at Anonymous function (/tmp/_karma_webpack_/commons.js:1529:5)
      11:33:59 	   at Generator.prototype.next (native code)	TypeError: Object doesn't support property or method 'execute'
      11:33:59 	   at Nuxeo.AggregateDataBehavior.fetch (/tmp/_karma_webpack_/commons.js:1223:5635)
      11:33:59 	   at Anonymous function (/tmp/_karma_webpack_/commons.js:1529:5)
      11:33:59 	   at Generator.prototype.next (native code)Edge 18.17763.0 (Windows 10.0.0) <nuxeo-audit-data> metrics FAILED
      11:33:59 	Error: Object doesn't support property or method 'execute' (/tmp/_karma_webpack_/commons.js:36926)	TypeError: Object doesn't support property or method 'execute'
      11:33:59 	   at Nuxeo.AggregateDataBehavior.fetch (/tmp/_karma_webpack_/commons.js:1223:5635)
      11:33:59 	   at Anonymous function (/tmp/_karma_webpack_/commons.js:1529:5)
      11:33:59 	   at Generator.prototype.next (native code)	TypeError: Object doesn't support property or method 'execute'
      11:33:59 	   at Nuxeo.AggregateDataBehavior.fetch (/tmp/_karma_webpack_/commons.js:1223:5635)
      11:33:59 	   at Anonymous function (/tmp/_karma_webpack_/commons.js:1529:5)
      11:33:59 	   at Generator.prototype.next (native code).......
      11:33:59 Edge 18.17763.0 (Windows 10.0.0) <nuxeo-workflow-data> metrics FAILED
      11:33:59 	TypeError: Unable to get property 'respondWith' of undefined or null reference
      11:33:59 	   at fakeResponse (/tmp/_karma_webpack_/commons.js:2070:5)
      11:33:59 	   at Anonymous function (/tmp/_karma_webpack_/commons.js:2104:5)
      11:33:59 	   at Generator.prototype.next (native code)Edge 18.17763.0 (Windows 10.0.0) <nuxeo-workflow-data> metrics FAILED
      11:33:59 	TypeError: Unable to get property 'respondWith' of undefined or null reference
      11:33:59 	   at fakeResponse (/tmp/_karma_webpack_/commons.js:2070:5)
      11:33:59 	   at Anonymous function (/tmp/_karma_webpack_/commons.js:2104:5)
      11:33:59 	   at Generator.prototype.next (native code)Edge 18.17763.0 (Windows 10.0.0) <nuxeo-workflow-data> metrics FAILED
      11:33:59 	TypeError: Unable to get property 'respondWith' of undefined or null reference
      11:33:59 	   at fakeResponse (/tmp/_karma_webpack_/commons.js:2070:5)
      11:33:59 	   at Anonymous function (/tmp/_karma_webpack_/commons.js:2104:5)
      11:33:59 	   at Generator.prototype.next (native code)	TypeError: Unable to get property 'respondWith' of undefined or null reference
      11:33:59 	   at fakeResponse (/tmp/_karma_webpack_/commons.js:2070:5)
      11:33:59 	   at Anonymous function (/tmp/_karma_webpack_/commons.js:2104:5)
      11:33:59 	   at Generator.prototype.next (native code)Edge 18.17763.0 (Windows 10.0.0) <nuxeo-workflow-data> metrics FAILED
      11:33:59 	TypeError: Unable to get property 'respondWith' of undefined or null reference
      11:33:59 	   at fakeResponse (/tmp/_karma_webpack_/commons.js:2070:5)
      11:33:59 	   at Anonymous function (/tmp/_karma_webpack_/commons.js:2104:5)
      11:33:59 	   at Generator.prototype.next (native code)	TypeError: Unable to get property 'respondWith' of undefined or null reference
      11:33:59 	   at fakeResponse (/tmp/_karma_webpack_/commons.js:2070:5)
      11:33:59 	   at Anonymous function (/tmp/_karma_webpack_/commons.js:2104:5)
      11:33:59 	   at Generator.prototype.next (native code)Edge 18.17763.0 (Windows 10.0.0) <nuxeo-workflow-data> grouped-by FAILED
      11:33:59 	TypeError: Unable to get property 'respondWith' of undefined or null reference
      11:33:59 	   at fakeResponse (/tmp/_karma_webpack_/commons.js:2070:5)
      11:33:59 	   at Anonymous function (/tmp/_karma_webpack_/commons.js:2120:5)
      11:33:59 	   at Generator.prototype.next (native code)Edge 18.17763.0 (Windows 10.0.0) <nuxeo-workflow-data> grouped-by FAILED
      11:33:59 	TypeError: Unable to get property 'respondWith' of undefined or null reference
      11:33:59 	   at fakeResponse (/tmp/_karma_webpack_/commons.js:2070:5)
      11:33:59 	   at Anonymous function (/tmp/_karma_webpack_/commons.js:2120:5)
      11:33:59 	   at Generator.prototype.next (native code)Edge 18.17763.0 (Windows 10.0.0) <nuxeo-workflow-data> grouped-by FAILED
      11:33:59 	TypeError: Unable to get property 'respondWith' of undefined or null reference
      11:33:59 	   at fakeResponse (/tmp/_karma_webpack_/commons.js:2070:5)
      11:33:59 	   at Anonymous function (/tmp/_karma_webpack_/commons.js:2120:5)
      11:33:59 	   at Generator.prototype.next (native code)	TypeError: Unable to get property 'respondWith' of undefined or null reference
      11:33:59 	   at fakeResponse (/tmp/_karma_webpack_/commons.js:2070:5)
      11:33:59 	   at Anonymous function (/tmp/_karma_webpack_/commons.js:2120:5)
      11:33:59 	   at Generator.prototype.next (native code)Edge 18.17763.0 (Windows 10.0.0) <nuxeo-workflow-data> grouped-by FAILED
      11:33:59 	TypeError: Unable to get property 'respondWith' of undefined or null reference
      11:33:59 	   at fakeResponse (/tmp/_karma_webpack_/commons.js:2070:5)
      11:33:59 	   at Anonymous function (/tmp/_karma_webpack_/commons.js:2120:5)
      11:33:59 	   at Generator.prototype.next (native code)	TypeError: Unable to get property 'respondWith' of undefined or null reference
      11:33:59 	   at fakeResponse (/tmp/_karma_webpack_/commons.js:2070:5)
      11:33:59 	   at Anonymous function (/tmp/_karma_webpack_/commons.js:2120:5)
      11:33:59 	   at Generator.prototype.next (native code)Edge 18.17763.0 (Windows 10.0.0) <nuxeo-workflow-data> multiple-groups FAILED
      11:33:59 	TypeError: Unable to get property 'respondWith' of undefined or null reference
      11:33:59 	   at fakeResponse (/tmp/_karma_webpack_/commons.js:2070:5)
      11:33:59 	   at Anonymous function (/tmp/_karma_webpack_/commons.js:2148:5)
      11:33:59 	   at Generator.prototype.next (native code)Edge 18.17763.0 (Windows 10.0.0) <nuxeo-workflow-data> multiple-groups FAILED
      11:33:59 	TypeError: Unable to get property 'respondWith' of undefined or null reference
      11:33:59 	   at fakeResponse (/tmp/_karma_webpack_/commons.js:2070:5)
      11:33:59 	   at Anonymous function (/tmp/_karma_webpack_/commons.js:2148:5)
      11:33:59 	   at Generator.prototype.next (native code)Edge 18.17763.0 (Windows 10.0.0) <nuxeo-workflow-data> multiple-groups FAILED
      11:33:59 	TypeError: Unable to get property 'respondWith' of undefined or null reference
      11:33:59 	   at fakeResponse (/tmp/_karma_webpack_/commons.js:2070:5)
      11:33:59 	   at Anonymous function (/tmp/_karma_webpack_/commons.js:2148:5)
      11:33:59 	   at Generator.prototype.next (native code)	TypeError: Unable to get property 'respondWith' of undefined or null reference
      11:33:59 	   at fakeResponse (/tmp/_karma_webpack_/commons.js:2070:5)
      11:33:59 	   at Anonymous function (/tmp/_karma_webpack_/commons.js:2148:5)
      11:33:59 	   at Generator.prototype.next (native code)Edge 18.17763.0 (Windows 10.0.0) <nuxeo-workflow-data> multiple-groups FAILED
      11:33:59 	TypeError: Unable to get property 'respondWith' of undefined or null reference
      11:33:59 	   at fakeResponse (/tmp/_karma_webpack_/commons.js:2070:5)
      11:33:59 	   at Anonymous function (/tmp/_karma_webpack_/commons.js:2148:5)
      11:33:59 	   at Generator.prototype.next (native code)	TypeError: Unable to get property 'respondWith' of undefined or null reference
      11:33:59 	   at fakeResponse (/tmp/_karma_webpack_/commons.js:2070:5)
      11:33:59 	   at Anonymous function (/tmp/_karma_webpack_/commons.js:2148:5)
      11:33:59 	   at Generator.prototype.next (native code)Edge 18.17763.0 (Windows 10.0.0) <nuxeo-workflow-data> ranges FAILED
      11:33:59 	TypeError: Unable to get property 'respondWith' of undefined or null reference
      11:33:59 	   at fakeResponse (/tmp/_karma_webpack_/commons.js:2070:5)
      11:33:59 	   at Anonymous function (/tmp/_karma_webpack_/commons.js:2161:5)
      11:33:59 	   at Generator.prototype.next (native code)Edge 18.17763.0 (Windows 10.0.0) <nuxeo-workflow-data> ranges FAILED
      11:33:59 	TypeError: Unable to get property 'respondWith' of undefined or null reference
      11:33:59 	   at fakeResponse (/tmp/_karma_webpack_/commons.js:2070:5)
      11:33:59 	   at Anonymous function (/tmp/_karma_webpack_/commons.js:2161:5)
      11:33:59 	   at Generator.prototype.next (native code)Edge 18.17763.0 (Windows 10.0.0) <nuxeo-workflow-data> ranges FAILED
      11:33:59 	TypeError: Unable to get property 'respondWith' of undefined or null reference
      11:33:59 	   at fakeResponse (/tmp/_karma_webpack_/commons.js:2070:5)
      11:33:59 	   at Anonymous function (/tmp/_karma_webpack_/commons.js:2161:5)
      11:33:59 	   at Generator.prototype.next (native code)	TypeError: Unable to get property 'respondWith' of undefined or null reference
      11:33:59 	   at fakeResponse (/tmp/_karma_webpack_/commons.js:2070:5)
      11:33:59 	   at Anonymous function (/tmp/_karma_webpack_/commons.js:2161:5)
      11:33:59 	   at Generator.prototype.next (native code)Edge 18.17763.0 (Windows 10.0.0) <nuxeo-workflow-data> ranges FAILED
      11:33:59 	TypeError: Unable to get property 'respondWith' of undefined or null reference
      11:33:59 	   at fakeResponse (/tmp/_karma_webpack_/commons.js:2070:5)
      11:33:59 	   at Anonymous function (/tmp/_karma_webpack_/commons.js:2161:5)
      11:33:59 	   at Generator.prototype.next (native code)	TypeError: Unable to get property 'respondWith' of undefined or null reference
      11:33:59 	   at fakeResponse (/tmp/_karma_webpack_/commons.js:2070:5)
      11:33:59 	   at Anonymous function (/tmp/_karma_webpack_/commons.js:2161:5)
      11:33:59 	   at Generator.prototype.next (native code)Edge 18.17763.0 (Windows 10.0.0) <nuxeo-workflow-data> date-intervals FAILED
      11:33:59 	TypeError: Unable to get property 'respondWith' of undefined or null reference
      11:33:59 	   at fakeResponse (/tmp/_karma_webpack_/commons.js:2070:5)
      11:33:59 	   at Anonymous function (/tmp/_karma_webpack_/commons.js:2191:5)
      11:33:59 	   at Generator.prototype.next (native code)Edge 18.17763.0 (Windows 10.0.0) <nuxeo-workflow-data> date-intervals FAILED
      11:33:59 	TypeError: Unable to get property 'respondWith' of undefined or null reference
      11:33:59 	   at fakeResponse (/tmp/_karma_webpack_/commons.js:2070:5)
      11:33:59 	   at Anonymous function (/tmp/_karma_webpack_/commons.js:2191:5)
      11:33:59 	   at Generator.prototype.next (native code)Edge 18.17763.0 (Windows 10.0.0) <nuxeo-workflow-data> date-intervals FAILED
      11:33:59 	TypeError: Unable to get property 'respondWith' of undefined or null reference
      11:33:59 	   at fakeResponse (/tmp/_karma_webpack_/commons.js:2070:5)
      11:33:59 	   at Anonymous function (/tmp/_karma_webpack_/commons.js:2191:5)
      11:33:59 	   at Generator.prototype.next (native code)	TypeError: Unable to get property 'respondWith' of undefined or null reference
      11:33:59 	   at fakeResponse (/tmp/_karma_webpack_/commons.js:2070:5)
      11:33:59 	   at Anonymous function (/tmp/_karma_webpack_/commons.js:2191:5)
      11:33:59 	   at Generator.prototype.next (native code)Edge 18.17763.0 (Windows 10.0.0) <nuxeo-workflow-data> date-intervals FAILED
      11:33:59 	TypeError: Unable to get property 'respondWith' of undefined or null reference
      11:33:59 	   at fakeResponse (/tmp/_karma_webpack_/commons.js:2070:5)
      11:33:59 	   at Anonymous function (/tmp/_karma_webpack_/commons.js:2191:5)
      11:33:59 	   at Generator.prototype.next (native code)	TypeError: Unable to get property 'respondWith' of undefined or null reference
      11:33:59 	   at fakeResponse (/tmp/_karma_webpack_/commons.js:2070:5)
      11:33:59 	   at Anonymous function (/tmp/_karma_webpack_/commons.js:2191:5)
      11:34:00 	   at Generator.prototype.next (native code)Edge 18.17763.0 (Windows 10.0.0): Executed 136 of 145 (15 FAILED) (skipped 4) (15.075 secs / NaN secs)
      11:34:00 Edge 18.17763.0 (Windows 10.0.0): Executed 136 of 145 (15 FAILED) (skipped 4) (15.076 secs / NaN secs)
      11:34:01 Edge 18.17763.0 (Windows 10.0.0) <nuxeo-workflow-data> "before each" hook for "workflow-terms" FAILED
      11:34:01 	Error: Not Found
      11:34:01 	   at Anonymous function (/tmp/_karma_webpack_/commons.js:84769:13)Edge 18.17763.0 (Windows 10.0.0) <nuxeo-workflow-data> "before each" hook for "workflow-terms" FAILED
      11:34:01 	Error: Not Found
      11:34:01 	   at Anonymous function (/tmp/_karma_webpack_/commons.js:84769:13)Edge 18.17763.0 (Windows 10.0.0)  "after each" hook in "{root}" FAILED
      11:34:01 	TypeError: Unable to get property 'call' of undefined or null referenceEdge 18.17763.0 (Windows 10.0.0)  "after each" hook in "{root}" FAILED
      11:34:01 	TypeError: Unable to get property 'call' of undefined or null referenceEdge 18.17763.0 (Windows 10.0.0): Executed 138 of 145 (17 FAILED) (skipped 4) (15.643 secs / NaN secs)
      

      see https://qa.nuxeo.org/jenkins/job/master/job/nuxeo-elements-master/235/console

        Attachments

          Issue Links

            Activity

              People

              • Votes:
                0 Vote for this issue
                Watchers:
                3 Start watching this issue

                Dates

                • Created:
                  Updated:
                  Resolved:

                  Time Tracking

                  Estimated:
                  Original Estimate - Not Specified
                  Not Specified
                  Remaining:
                  Remaining Estimate - 0 minutes
                  0m
                  Logged:
                  Time Spent - 3 hours, 30 minutes
                  3h 30m

                    PagerDuty