Uploaded image for project: 'Nuxeo Platform'
  1. Nuxeo Platform
  2. NXP-24242

Fix FT failure ITLoginLogoutTest

    XMLWordPrintable

    Details

    • Type: Bug
    • Status: Resolved
    • Priority: Major
    • Resolution: Won't Fix
    • Affects Version/s: 8.10, 10.3-SNAPSHOT
    • Fix Version/s: None
    • Component/s: Dev Tools

      Description

      See https://qa2.nuxeo.org/jenkins/view/8.10/job/8.10/job/packages_marketplace-platform-explorer-1.6_8.10/

      Console output
      00:27:29 Running org.nuxeo.functionaltests.ITLoginLogoutTest
      00:27:29 00:27:29,235 INFO  [AbstractTest] Starting test 'org.nuxeo.functionaltests.ITLoginLogoutTest#testLoginLogout'
      00:27:41 00:27:41,535 ERROR [AbstractTest] Test 'org.nuxeo.functionaltests.ITLoginLogoutTest#testLoginLogout' failed
      00:27:41 java.lang.AssertionError: 12 Javascript error(s) detected: ["calling a builtin ArrayBuffer constructor without new is deprecated and will be forbidden in ES6" at https://js.intercomcdn.com/frame.ba1e4d11.js line 1, "calling a builtin typed array constructor without new is deprecated and will be forbidden in ES6" at https://js.intercomcdn.com/frame.ba1e4d11.js line 1, "calling a builtin typed array constructor without new is deprecated and will be forbidden in ES6" at https://js.intercomcdn.com/frame.ba1e4d11.js line 1, "calling a builtin typed array constructor without new is deprecated and will be forbidden in ES6" at https://js.intercomcdn.com/frame.ba1e4d11.js line 1, "calling a builtin typed array constructor without new is deprecated and will be forbidden in ES6" at https://js.intercomcdn.com/frame.ba1e4d11.js line 1, "calling a builtin typed array constructor without new is deprecated and will be forbidden in ES6" at https://js.intercomcdn.com/frame.ba1e4d11.js line 1, "calling a builtin typed array constructor without new is deprecated and will be forbidden in ES6" at https://js.intercomcdn.com/frame.ba1e4d11.js line 1, "calling a builtin typed array constructor without new is deprecated and will be forbidden in ES6" at https://js.intercomcdn.com/frame.ba1e4d11.js line 1, "calling a builtin typed array constructor without new is deprecated and will be forbidden in ES6" at https://js.intercomcdn.com/frame.ba1e4d11.js line 1, "calling a builtin typed array constructor without new is deprecated and will be forbidden in ES6" at https://js.intercomcdn.com/frame.ba1e4d11.js line 1]
      00:27:41 	at org.junit.Assert.fail(Assert.java:88)
      00:27:41 	at org.nuxeo.functionaltests.JavaScriptErrorCollector.checkForErrors(JavaScriptErrorCollector.java:93)
      00:27:41 	at org.nuxeo.functionaltests.AbstractTest.get(AbstractTest.java:295)
      00:27:41 	at org.nuxeo.functionaltests.ITLoginLogoutTest.testLoginLogout(ITLoginLogoutTest.java:33)
      00:27:41 	at sun.reflect.NativeMethodAccessorImpl.invoke0(Native Method)
      00:27:41 	at sun.reflect.NativeMethodAccessorImpl.invoke(NativeMethodAccessorImpl.java:62)
      00:27:41 	at sun.reflect.DelegatingMethodAccessorImpl.invoke(DelegatingMethodAccessorImpl.java:43)
      00:27:41 	at java.lang.reflect.Method.invoke(Method.java:498)
      00:27:41 	at org.junit.runners.model.FrameworkMethod$1.runReflectiveCall(FrameworkMethod.java:47)
      00:27:41 	at org.junit.internal.runners.model.ReflectiveCallable.run(ReflectiveCallable.java:12)
      00:27:41 	at org.junit.runners.model.FrameworkMethod.invokeExplosively(FrameworkMethod.java:44)
      00:27:41 	at org.junit.internal.runners.statements.InvokeMethod.evaluate(InvokeMethod.java:17)
      00:27:41 	at org.junit.internal.runners.statements.RunAfters.evaluate(RunAfters.java:27)
      00:27:41 	at org.nuxeo.functionaltests.LogTestWatchman$1.evaluate(LogTestWatchman.java:103)
      00:27:41 	at org.junit.runners.ParentRunner.runLeaf(ParentRunner.java:271)
      00:27:41 	at org.junit.runners.BlockJUnit4ClassRunner.runChild(BlockJUnit4ClassRunner.java:70)
      00:27:41 	at org.junit.runners.BlockJUnit4ClassRunner.runChild(BlockJUnit4ClassRunner.java:50)
      00:27:41 	at org.junit.runners.ParentRunner$3.run(ParentRunner.java:238)
      00:27:41 	at org.junit.runners.ParentRunner$1.schedule(ParentRunner.java:63)
      00:27:41 	at org.junit.runners.ParentRunner.runChildren(ParentRunner.java:236)
      00:27:41 	at org.junit.runners.ParentRunner.access$000(ParentRunner.java:53)
      00:27:41 	at org.junit.runners.ParentRunner$2.evaluate(ParentRunner.java:229)
      00:27:41 	at org.junit.internal.runners.statements.RunBefores.evaluate(RunBefores.java:26)
      00:27:41 	at org.junit.internal.runners.statements.RunAfters.evaluate(RunAfters.java:27)
      00:27:41 	at org.junit.runners.ParentRunner.run(ParentRunner.java:309)
      00:27:41 	at org.junit.runners.Suite.runChild(Suite.java:127)
      00:27:41 	at org.junit.runners.Suite.runChild(Suite.java:26)
      00:27:41 	at org.junit.runners.ParentRunner$3.run(ParentRunner.java:238)
      00:27:41 	at org.junit.runners.ParentRunner$1.schedule(ParentRunner.java:63)
      00:27:41 	at org.junit.runners.ParentRunner.runChildren(ParentRunner.java:236)
      00:27:41 	at org.junit.runners.ParentRunner.access$000(ParentRunner.java:53)
      00:27:41 	at org.junit.runners.ParentRunner$2.evaluate(ParentRunner.java:229)
      00:27:41 	at org.junit.runners.ParentRunner.run(ParentRunner.java:309)
      00:27:41 	at org.junit.runner.JUnitCore.run(JUnitCore.java:160)
      00:27:41 	at org.junit.runner.JUnitCore.run(JUnitCore.java:138)
      00:27:41 	at org.apache.maven.surefire.junitcore.JUnitCoreWrapper.createRequestAndRun(JUnitCoreWrapper.java:113)
      00:27:41 	at org.apache.maven.surefire.junitcore.JUnitCoreWrapper.executeEager(JUnitCoreWrapper.java:85)
      00:27:41 	at org.apache.maven.surefire.junitcore.JUnitCoreWrapper.execute(JUnitCoreWrapper.java:54)
      00:27:41 	at org.apache.maven.surefire.junitcore.JUnitCoreProvider.invoke(JUnitCoreProvider.java:134)
      00:27:41 	at org.apache.maven.surefire.booter.ForkedBooter.invokeProviderInSameClassLoader(ForkedBooter.java:200)
      00:27:41 	at org.apache.maven.surefire.booter.ForkedBooter.runSuitesInProcess(ForkedBooter.java:153)
      00:27:41 	at org.apache.maven.surefire.booter.ForkedBooter.main(ForkedBooter.java:103)
      00:27:41 00:27:41,538 INFO  [AbstractTest] Created screenshot file named '/opt/jenkins/workspace/8.10/packages_marketplace-platform-explorer-1.6_8.10/ftest/webdriver/target/screenshot-lastpage-org.nuxeo.functionaltests.ITLoginLogoutTest-testLoginLogout7720592923333681744.png'
      00:27:41 00:27:41,538 INFO  [AbstractTest] Created page source file named '/opt/jenkins/workspace/8.10/packages_marketplace-platform-explorer-1.6_8.10/ftest/webdriver/target/screenshot-lastpage-org.nuxeo.functionaltests.ITLoginLogoutTest-testLoginLogout3550055642848095202.html'
      00:27:41 00:27:41,538 INFO  [AbstractTest] Finished test 'org.nuxeo.functionaltests.ITLoginLogoutTest#testLoginLogout'
      00:27:41 Tests run: 1, Failures: 1, Errors: 0, Skipped: 0, Time elapsed: 12.376 sec <<< FAILURE! - in org.nuxeo.functionaltests.ITLoginLogoutTest
      00:27:41 testLoginLogout(org.nuxeo.functionaltests.ITLoginLogoutTest)  Time elapsed: 12.3 sec  <<< FAILURE!
      00:27:41 java.lang.AssertionError: 12 Javascript error(s) detected: ["calling a builtin ArrayBuffer constructor without new is deprecated and will be forbidden in ES6" at https://js.intercomcdn.com/frame.ba1e4d11.js line 1, "calling a builtin typed array constructor without new is deprecated and will be forbidden in ES6" at https://js.intercomcdn.com/frame.ba1e4d11.js line 1, "calling a builtin typed array constructor without new is deprecated and will be forbidden in ES6" at https://js.intercomcdn.com/frame.ba1e4d11.js line 1, "calling a builtin typed array constructor without new is deprecated and will be forbidden in ES6" at https://js.intercomcdn.com/frame.ba1e4d11.js line 1, "calling a builtin typed array constructor without new is deprecated and will be forbidden in ES6" at https://js.intercomcdn.com/frame.ba1e4d11.js line 1, "calling a builtin typed array constructor without new is deprecated and will be forbidden in ES6" at https://js.intercomcdn.com/frame.ba1e4d11.js line 1, "calling a builtin typed array constructor without new is deprecated and will be forbidden in ES6" at https://js.intercomcdn.com/frame.ba1e4d11.js line 1, "calling a builtin typed array constructor without new is deprecated and will be forbidden in ES6" at https://js.intercomcdn.com/frame.ba1e4d11.js line 1, "calling a builtin typed array constructor without new is deprecated and will be forbidden in ES6" at https://js.intercomcdn.com/frame.ba1e4d11.js line 1, "calling a builtin typed array constructor without new is deprecated and will be forbidden in ES6" at https://js.intercomcdn.com/frame.ba1e4d11.js line 1]
      00:27:41 	at org.junit.Assert.fail(Assert.java:88)
      00:27:41 	at org.nuxeo.functionaltests.JavaScriptErrorCollector.checkForErrors(JavaScriptErrorCollector.java:93)
      00:27:41 	at org.nuxeo.functionaltests.AbstractTest.get(AbstractTest.java:295)
      00:27:41 	at org.nuxeo.functionaltests.ITLoginLogoutTest.testLoginLogout(ITLoginLogoutTest.java:33)
      00:27:41 
      00:27:41 
      00:27:41 Results :
      00:27:41 
      00:27:41 Failed tests: 
      00:27:41   ITLoginLogoutTest.testLoginLogout:33->AbstractTest.get:295 12 Javascript error(s) detected: ["calling a builtin ArrayBuffer constructor without new is deprecated and will be forbidden in ES6" at https://js.intercomcdn.com/frame.ba1e4d11.js line 1, "calling a builtin typed array constructor without new is deprecated and will be forbidden in ES6" at https://js.intercomcdn.com/frame.ba1e4d11.js line 1, "calling a builtin typed array constructor without new is deprecated and will be forbidden in ES6" at https://js.intercomcdn.com/frame.ba1e4d11.js line 1, "calling a builtin typed array constructor without new is deprecated and will be forbidden in ES6" at https://js.intercomcdn.com/frame.ba1e4d11.js line 1, "calling a builtin typed array constructor without new is deprecated and will be forbidden in ES6" at https://js.intercomcdn.com/frame.ba1e4d11.js line 1, "calling a builtin typed array constructor without new is deprecated and will be forbidden in ES6" at https://js.intercomcdn.com/frame.ba1e4d11.js line 1, "calling a builtin typed array constructor without new is deprecated and will be forbidden in ES6" at https://js.intercomcdn.com/frame.ba1e4d11.js line 1, "calling a builtin typed array constructor without new is deprecated and will be forbidden in ES6" at https://js.intercomcdn.com/frame.ba1e4d11.js line 1, "calling a builtin typed array constructor without new is deprecated and will be forbidden in ES6" at https://js.intercomcdn.com/frame.ba1e4d11.js line 1, "calling a builtin typed array constructor without new is deprecated and will be forbidden in ES6" at https://js.intercomcdn.com/frame.ba1e4d11.js line 1]
      00:27:41 
      00:27:41 Tests run: 1, Failures: 1, Errors: 0, Skipped: 0
      00:27:41 
      00:27:41 [JENKINS] Recording test results
      00:27:43 [INFO] 
      00:27:43 [INFO] --- ant-assembly-maven-plugin:2.0.6:build (stop-nuxeo) @ webdriver ---
      00:27:43 [INFO] Active Maven profiles:
      00:27:43 qa (source: external)
      00:27:43 tomcat (source: org.nuxeo.ecm.distribution:webdriver:1.6.5-SNAPSHOT)
      00:27:43 ftest (source: org.nuxeo.ecm.distribution:marketplace-platform-explorer-parent:1.6.5-SNAPSHOT)
      00:27:43 qa (source: org.nuxeo.ecm.distribution:nuxeo-distribution:8.10-HF24-SNAPSHOT)
      00:27:43 qa (source: org.nuxeo:nuxeo-ecm:8.10-HF24-SNAPSHOT)
      00:27:43 os-notwindows (source: org.nuxeo:nuxeo-ecm:8.10-HF24-SNAPSHOT)
      00:27:43 [INFO] Managed version set on org.nuxeo:nuxeo-ftest:zip:1.8.3
      00:27:43 [INFO]     [unzip] Expanding: /opt/jenkins/.m2/repository/org/nuxeo/nuxeo-ftest/1.8.3/nuxeo-ftest-1.8.3.zip into /opt/jenkins/workspace/8.10/packages_marketplace-platform-explorer-1.6_8.10/ftest/webdriver/target
      00:27:44 
      00:27:44 sample-webdriver-tests.stop-unix:
      00:27:44 [INFO]      [exec] Detected Tomcat server.
      00:27:44 [INFO]      [exec] Nuxeo home:          /opt/jenkins/workspace/8.10/packages_marketplace-platform-explorer-1.6_8.10/ftest/webdriver/target/tomcat
      00:27:44 [INFO]      [exec] Nuxeo configuration: /opt/jenkins/workspace/8.10/packages_marketplace-platform-explorer-1.6_8.10/ftest/webdriver/target/tomcat/bin/nuxeo.conf
      00:27:44 [INFO]      [exec] Include template: /opt/jenkins/workspace/8.10/packages_marketplace-platform-explorer-1.6_8.10/ftest/webdriver/target/tomcat/templates/common-base
      00:27:44 [INFO]      [exec] Include template: /opt/jenkins/workspace/8.10/packages_marketplace-platform-explorer-1.6_8.10/ftest/webdriver/target/tomcat/templates/common
      00:27:44 [INFO]      [exec] Include template: /opt/jenkins/workspace/8.10/packages_marketplace-platform-explorer-1.6_8.10/ftest/webdriver/target/tomcat/templates/default
      00:27:45 [INFO]      [exec] Stopping server....Server stopped.
      00:27:45 
      00:27:45 sample-webdriver-tests.stop:
      00:27:45 [INFO] Managed version set on org.nuxeo:nuxeo-ftest:zip:1.8.3
      00:27:45 [INFO]     [unzip] Expanding: /opt/jenkins/.m2/repository/org/nuxeo/nuxeo-ftest/1.8.3/nuxeo-ftest-1.8.3.zip into /opt/jenkins/workspace/8.10/packages_marketplace-platform-explorer-1.6_8.10/ftest/webdriver/target
      00:27:46 [INFO] 
      00:27:46 [INFO] --- maven-failsafe-plugin:2.17:verify (default) @ webdriver ---
      00:27:46 [INFO] Failsafe report directory: /opt/jenkins/workspace/8.10/packages_marketplace-platform-explorer-1.6_8.10/ftest/webdriver/target/failsafe-reports
      00:27:46 [ERROR] There are test failures.
      00:27:46 
      00:27:46 Please refer to /opt/jenkins/workspace/8.10/packages_marketplace-platform-explorer-1.6_8.10/ftest/webdriver/target/failsafe-reports for the individual test results.
      00:27:46 [JENKINS] Recording test results
      00:27:46 [INFO] 
      00:27:46 [INFO] --- maven-install-plugin:2.5.1:install (default-install) @ webdriver ---
      00:27:46 [INFO] Installing /opt/jenkins/workspace/8.10/packages_marketplace-platform-explorer-1.6_8.10/ftest/webdriver/pom.xml to /opt/jenkins/.m2/repository/org/nuxeo/ecm/distribution/webdriver/1.6.5-SNAPSHOT/webdriver-1.6.5-SNAPSHOT.jar
      00:27:46 [INFO] Installing /opt/jenkins/workspace/8.10/packages_marketplace-platform-explorer-1.6_8.10/ftest/webdriver/pom.xml to /opt/jenkins/.m2/repository/org/nuxeo/ecm/distribution/webdriver/1.6.5-SNAPSHOT/webdriver-1.6.5-SNAPSHOT.pom
      00:27:46 [JENKINS] Archiving disabled
      00:27:46 Notifying upstream projects of job completion
      00:27:46 Join notifier requires a CauseAction
      00:27:46 [JENKINS] Archiving disabled
      00:27:46 [JENKINS] Archiving disabled
      00:27:46 [JENKINS] Archiving disabled
      00:27:46 [INFO] ------------------------------------------------------------------------
      00:27:46 [INFO] Reactor Summary:
      00:27:46 [INFO] 
      00:27:46 [INFO] Marketplace Platform Explorer - Parent ............. SUCCESS [  7.089 s]
      00:27:46 [INFO] Marketplace Platform Explorer - Marketplace ........ SUCCESS [03:46 min]
      00:27:46 [INFO] Marketplace Platform Explorer - Webdriver Functionnal Tests SUCCESS [01:40 min]
      00:27:46 [INFO] ------------------------------------------------------------------------
      00:27:46 [INFO] BUILD SUCCESS
      00:27:46 [INFO] ------------------------------------------------------------------------
      00:27:46 [INFO] Total time: 05:46 min
      00:27:46 [INFO] Finished at: 2018-01-23T00:27:46+00:00
      00:27:47 [INFO] Final Memory: 120M/475M
      00:27:47 [INFO] ------------------------------------------------------------------------
      00:27:47 channel stopped
      00:27:47 [WARNINGS] Parsing warnings in console log with parser Java Compiler (javac)
      00:27:48 [WARNINGS] Parsing warnings in console log with parser Maven
      00:27:48 [WARNINGS] Computing warning deltas based on reference build #393
      00:27:48 Archiving artifacts
      00:27:48 Compressed 1.65 MB of artifacts by 41.8% relative to #393
      00:27:48 Checking ^\d{4}-\d{2}-\d{2}.*ERROR.*
      00:27:48 [Set GitHub commit status (universal)] FAILURE on repos [GHRepository@13b1ede0[description=  Package and tests for the Platform Explorer addon (apidoc),homepage=<null>,name=marketplace-platform-explorer,license=<null>,fork=false,size=73,milestones={},language=Java,commits={},source=<null>,parent=<null>,responseHeaderFields={null=[HTTP/1.1 200 OK], Access-Control-Allow-Origin=[*], Access-Control-Expose-Headers=[ETag, Link, Retry-After, X-GitHub-OTP, X-RateLimit-Limit, X-RateLimit-Remaining, X-RateLimit-Reset, X-OAuth-Scopes, X-Accepted-OAuth-Scopes, X-Poll-Interval], Cache-Control=[private, max-age=60, s-maxage=60], Content-Encoding=[gzip], Content-Security-Policy=[default-src 'none'], Content-Type=[application/json; charset=utf-8], Date=[Tue, 23 Jan 2018 00:27:48 GMT], ETag=[W/"37042bbf0856d650d363d63e2c1ceb48"], Last-Modified=[Mon, 10 Oct 2016 15:38:00 GMT], OkHttp-Received-Millis=[1516667268958], OkHttp-Response-Source=[NETWORK 200], OkHttp-Selected-Protocol=[http/1.1], OkHttp-Sent-Millis=[1516667268816], Server=[GitHub.com], Status=[200 OK], Strict-Transport-Security=[max-age=31536000; includeSubdomains; preload], Transfer-Encoding=[chunked], Vary=[Accept, Authorization, Cookie, X-GitHub-OTP], X-Accepted-OAuth-Scopes=[repo], X-Content-Type-Options=[nosniff], X-Frame-Options=[deny], X-GitHub-Media-Type=[github.v3; format=json], X-GitHub-Request-Id=[9A58:7DC4:E030A:2411AC:5A66817A], X-OAuth-Scopes=[gist, notifications, repo], X-RateLimit-Limit=[5000], X-RateLimit-Remaining=[4752], X-RateLimit-Reset=[1516668187], X-Runtime-rack=[0.059762], X-XSS-Protection=[1; mode=block]},url=https://api.github.com/repos/nuxeo/marketplace-platform-explorer,id=5690166]] (sha:0b72b7b) with context:8.10/packages_marketplace-platform-explorer-1.6_8.10
      00:27:48 Setting commit status on GitHub for https://github.com/nuxeo/marketplace-platform-explorer/commit/0b72b7b43cd82d4860769091e3ceec0ae3d3a48d
      00:27:49 Notifying upstream projects of job completion
      00:27:49 No emails were triggered.
      00:27:49 Jabber notifier plugin: Notifying suspects
      00:27:49 Jabber notifier plugin: Notifying culprits
      00:27:49 Jabber notifier plugin: Sending notification to culprit: jenkins@nuxeo.com
      00:27:49 Jabber notifier plugin: Sending notification to culprit: ffischer@nuxeo.com
      00:27:49 Finished: UNSTABLE
      

        Attachments

          Activity

            People

            • Votes:
              0 Vote for this issue
              Watchers:
              2 Start watching this issue

              Dates

              • Created:
                Updated:
                Resolved: